Entry_ID,State Patient Number,Date Announced,Age Bracket,Gender,Detected City,Detected District,Detected State,State code,Num Cases,Current Status,Contracted from which Patient (Suspected),Notes,Source_1,Source_2,Source_3,Nationality,Type of transmission,Status Change Date,Patient Number
117644,,08/07/2020,,,,Unassigned,State Unassigned,UN,-16,Hospitalized,,,https://www.mohfw.gov.in,,,,,,
117645,,08/07/2020,,,,,Andaman and Nicobar Islands,AN,2,Hospitalized,,Both Contacts,https://twitter.com/Andaman_Admin/status/1280708268705214465?s=19,,,,,,
117646,,08/07/2020,,,,Dimapur,Nagaland,NL,9,Hospitalized,,,https://twitter.com/pangnyu/status/1280702627836071936?s=19,,,,,,
117647,,08/07/2020,,,,Kohima,Nagaland,NL,1,Hospitalized,,,https://twitter.com/pangnyu/status/1280702627836071936?s=19,,,,,,
117648,,08/07/2020,,,,Mon,Nagaland,NL,1,Hospitalized,,,https://twitter.com/pangnyu/status/1280702627836071936?s=19,,,,,,
117649,,08/07/2020,,,,Mokokchung,Nagaland,NL,1,Hospitalized,,,https://twitter.com/pangnyu/status/1280702627836071936?s=19,,,,,,
117650,,08/07/2020,,,,Angul,Odisha,OR,1,Hospitalized,,,https://twitter.com/IPR_Odisha/status/1280725468329566209,,,,,,
117651,,08/07/2020,,,,Balasore,Odisha,OR,26,Hospitalized,,,https://twitter.com/IPR_Odisha/status/1280725468329566209?s=20,,,,,,
117652,,08/07/2020,,,,Bargarh,Odisha,OR,1,Hospitalized,,,https://twitter.com/IPR_Odisha/status/1280725468329566209?s=20,,,,,,
117653,,08/07/2020,,,,Bhadrak,Odisha,OR,2,Hospitalized,,,https://twitter.com/IPR_Odisha/status/1280725468329566209?s=20,,,,,,
117654,,08/07/2020,,,,Balangir,Odisha,OR,21,Hospitalized,,,https://twitter.com/IPR_Odisha/status/1280725468329566209?s=20,,,,,,
117655,,08/07/2020,,,,Cuttack,Odisha,OR,17,Hospitalized,,,https://twitter.com/IPR_Odisha/status/1280725468329566209?s=20,,,,,,
117656,,08/07/2020,,,,Dhenkanal,Odisha,OR,1,Hospitalized,,,https://twitter.com/IPR_Odisha/status/1280725468329566209?s=20,,,,,,
117657,,08/07/2020,,,,Gajapati,Odisha,OR,3,Hospitalized,,,https://twitter.com/IPR_Odisha/status/1280725468329566209?s=20,,,,,,
117658,,08/07/2020,,,,Ganjam,Odisha,OR,215,Hospitalized,,,https://twitter.com/IPR_Odisha/status/1280725468329566209?s=20,,,,,,
117659,,08/07/2020,,,,Jagatsinghpur,Odisha,OR,4,Hospitalized,,,https://twitter.com/IPR_Odisha/status/1280725468329566209?s=20,,,,,,
117660,,08/07/2020,,,,Jajpur,Odisha,OR,25,Hospitalized,,,https://twitter.com/IPR_Odisha/status/1280725468329566209?s=20,,,,,,
117661,,08/07/2020,,,,Jharsuguda,Odisha,OR,4,Hospitalized,,,https://twitter.com/IPR_Odisha/status/1280725468329566209?s=20,,,,,,
117662,,08/07/2020,,,,Kendrapara,Odisha,OR,5,Hospitalized,,,https://twitter.com/IPR_Odisha/status/1280725468329566209?s=20,,,,,,
117663,,08/07/2020,,,,Kendujhar,Odisha,OR,7,Hospitalized,,,https://twitter.com/IPR_Odisha/status/1280725468329566209?s=20,,,,,,
117664,,08/07/2020,,,,Khordha,Odisha,OR,50,Hospitalized,,,https://twitter.com/IPR_Odisha/status/1280725468329566209?s=20,,,,,,
117665,,08/07/2020,,,,Koraput,Odisha,OR,6,Hospitalized,,,https://twitter.com/IPR_Odisha/status/1280725468329566209?s=20,,,,,,
117666,,08/07/2020,,,,Malkangiri,Odisha,OR,3,Hospitalized,,,https://twitter.com/IPR_Odisha/status/1280725468329566209?s=20,,,,,,
117667,,08/07/2020,,,,Mayurbhanj,Odisha,OR,10,Hospitalized,,,https://twitter.com/IPR_Odisha/status/1280725468329566209?s=20,,,,,,
117668,,08/07/2020,,,,Nabarangapur,Odisha,OR,3,Hospitalized,,,https://twitter.com/IPR_Odisha/status/1280725468329566209?s=20,,,,,,
117669,,08/07/2020,,,,Nayagarh,Odisha,OR,18,Hospitalized,,,https://twitter.com/IPR_Odisha/status/1280725468329566209?s=20,,,,,,
117670,,08/07/2020,,,,Nuapada,Odisha,OR,4,Hospitalized,,,https://twitter.com/IPR_Odisha/status/1280725468329566209?s=20,,,,,,
117671,,08/07/2020,,,,Puri,Odisha,OR,16,Hospitalized,,,https://twitter.com/IPR_Odisha/status/1280725468329566209?s=20,,,,,,
117672,,08/07/2020,,,,Rayagada,Odisha,OR,1,Hospitalized,,,https://twitter.com/IPR_Odisha/status/1280725468329566209?s=20,,,,,,
117673,,08/07/2020,,,,Sambalpur,Odisha,OR,1,Hospitalized,,,https://twitter.com/IPR_Odisha/status/1280725468329566209?s=20,,,,,,
117674,,08/07/2020,,,,Subarnapur,Odisha,OR,5,Hospitalized,,,https://twitter.com/IPR_Odisha/status/1280725468329566209?s=20,,,,,,
117675,,08/07/2020,,,,Sundargarh,Odisha,OR,78,Hospitalized,,,https://twitter.com/IPR_Odisha/status/1280725468329566209?s=20,,,,,,
117676,,08/07/2020,,,,East Khasi Hills,Meghalaya,ML,4,Hospitalized,,4 more persons have tested positive for COVID19 in Shillong. 3 BSF personnel and 1 patient who has come from Tripura for treatment to NEIGRIHMS.,https://twitter.com/SangmaConrad/status/1280731915675291648?s=20,,,,,,
117677,,08/07/2020,80,M,,Rayagada,Odisha,OR,1,Deceased,,Also suffering from Chronic Obstructive Pulmonary Disease.,https://twitter.com/HFWOdisha/status/1280734479472922624,,,,,,
117678,,08/07/2020,56,M,,Ganjam,Odisha,OR,1,Deceased,,,https://twitter.com/HFWOdisha/status/1280734479472922624?s=20,,,,,,
117679,,08/07/2020,49,M,,Kendrapara,Odisha,OR,1,Deceased,,Also suffering from Diabetes.,https://twitter.com/HFWOdisha/status/1280734479472922624?s=20,,,,,,
117680,,08/07/2020,55,M,Bhubaneswar,Khordha,Odisha,OR,1,Deceased,,,https://twitter.com/HFWOdisha/status/1280734479472922624?s=20,,,,,,
117681,,08/07/2020,64,M,,Ganjam,Odisha,OR,1,Deceased,,Also suffering from Diabetes.,https://twitter.com/HFWOdisha/status/1280734479472922624?s=20,,,,,,
117682,,08/07/2020,50,F,,Ganjam,Odisha,OR,1,Deceased,,Also suffering from Diabetes.,https://twitter.com/HFWOdisha/status/1280734479472922624?s=20,,,,,,
117683,,08/07/2020,,,,Puducherry,Puducherry,PY,79,Hospitalized,,,https://t.me/indiacovid/9721,,,,,,
117684,,08/07/2020,,,,Puducherry,Puducherry,PY,65,Recovered,,,https://t.me/indiacovid/9721,,,,,,
117685,,08/07/2020,,,,Karaikal,Puducherry,PY,25,Hospitalized,,,https://t.me/indiacovid/9721,,,,,,
117686,,08/07/2020,,,,Yanam,Puducherry,PY,8,Hospitalized,,,https://t.me/indiacovid/9721,,,,,,
117687,,08/07/2020,,,,Mahe,Puducherry,PY,2,Recovered,,,https://t.me/indiacovid/9721,,,,,,
117688,,08/07/2020,,,,Yanam,Puducherry,PY,-2,Hospitalized,,Transferred to AP,https://t.me/indiacovid/9721,,,,,,
117689,,07/07/2020,,,,Puducherry,Puducherry,PY,-2,Hospitalized,,Transferred to Unknown,https://t.me/indiacovid/9721,,,,,,
117690,,08/07/2020,60,M,"R/o Hidayatpur,Guwahati",Kamrup Metropolitan,Assam,AS,1,Deceased,,Sri Safikul Rehman,https://twitter.com/himantabiswa/status/1280738153721028608?s=20,,,,,,
117691,,08/07/2020,60,F,"R/o Patachurkuchi,Barpeta",Barpeta,Assam,AS,1,Deceased,,Sri Romoni Mazumdar,https://twitter.com/himantabiswa/status/1280738153721028608?s=20,,,,,,
117692,,08/07/2020,75,M,"R/o Khalilipara,Dispur",Kamrup Metropolitan,Assam,AS,1,Deceased,,Sri Utpal Kumar Chaliha,https://twitter.com/himantabiswa/status/1280738153721028608?s=20,,,,,,
117693,,08/07/2020,68,M,"R/o Lalganesh, Guwahati",Kamrup Metropolitan,Assam,AS,1,Deceased,,Sri Hariprasad Mandal,https://twitter.com/himantabiswa/status/1280738153721028608?s=20,,,,,,
117694,,08/07/2020,53,M,,Khordha,Odisha,OR,1,Deceased,,"Patient who also tested positive for Covid, succumbed to HIV-AIDS.",https://twitter.com/HFWOdisha/status/1280739613900828672?s=20,,,,,,
117695,,08/07/2020,,,,Ajmer,Rajasthan,RJ,2,Hospitalized,,,https://twitter.com/airnews_jaipur/status/1280743894481694721?s=20,,,,,,
117696,,08/07/2020,,,,Alwar,Rajasthan,RJ,81,Hospitalized,,,https://twitter.com/airnews_jaipur/status/1280743894481694721?s=20,,,,,,
117697,,08/07/2020,,,,Bhilwara,Rajasthan,RJ,11,Hospitalized,,,https://twitter.com/airnews_jaipur/status/1280743894481694721?s=20,,,,,,
117698,,08/07/2020,,,,Bikaner,Rajasthan,RJ,8,Hospitalized,,,https://twitter.com/airnews_jaipur/status/1280743894481694721?s=20,,,,,,
117699,,08/07/2020,,,,Churu,Rajasthan,RJ,3,Hospitalized,,,https://twitter.com/airnews_jaipur/status/1280743894481694721?s=20,,,,,,
117700,,08/07/2020,,,,Dungarpur,Rajasthan,RJ,1,Hospitalized,,,https://twitter.com/airnews_jaipur/status/1280743894481694721?s=20,,,,,,
117701,,08/07/2020,,,,Jaipur,Rajasthan,RJ,34,Hospitalized,,,https://twitter.com/airnews_jaipur/status/1280743894481694721?s=20,,,,,,
117702,,08/07/2020,,,,Jhalawar,Rajasthan,RJ,1,Hospitalized,,,https://twitter.com/airnews_jaipur/status/1280743894481694721?s=20,,,,,,
117703,,08/07/2020,,,,Kota,Rajasthan,RJ,12,Hospitalized,,,https://twitter.com/airnews_jaipur/status/1280743894481694721?s=20,,,,,,
117704,,08/07/2020,,,,Nagaur,Rajasthan,RJ,8,Hospitalized,,,https://twitter.com/airnews_jaipur/status/1280743894481694721?s=20,,,,,,
117705,,08/07/2020,,,,Rajsamand,Rajasthan,RJ,10,Hospitalized,,,https://twitter.com/airnews_jaipur/status/1280743894481694721?s=20,,,,,,
117706,,08/07/2020,,,,Udaipur,Rajasthan,RJ,2,Hospitalized,,,https://twitter.com/airnews_jaipur/status/1280743894481694721?s=20,,,,,,
117707,,08/07/2020,,,,Bikaner,Rajasthan,RJ,1,Deceased,,,https://twitter.com/airnews_jaipur/status/1280743894481694721?s=20,,,,,,
117708,,08/07/2020,,,,Dausa,Rajasthan,RJ,1,Deceased,,,https://twitter.com/airnews_jaipur/status/1280743894481694721?s=20,,,,,,
117709,,08/07/2020,,,,Jaipur,Rajasthan,RJ,2,Deceased,,,https://twitter.com/airnews_jaipur/status/1280743894481694721?s=20,,,,,,
117710,,08/07/2020,,,,Jodhpur,Rajasthan,RJ,1,Deceased,,,https://twitter.com/airnews_jaipur/status/1280743894481694721?s=20,,,,,,
117711,,08/07/2020,,,,Sawai Madhopur,Rajasthan,RJ,1,Deceased,,,https://twitter.com/airnews_jaipur/status/1280743894481694721?s=20,,,,,,
117712,,08/07/2020,,,,Bhilwara,Rajasthan,RJ,2,Recovered,,,https://twitter.com/airnews_jaipur/status/1280743894481694721?s=20,,,,,,
117713,,08/07/2020,,,,Jaipur,Rajasthan,RJ,6,Recovered,,,https://twitter.com/airnews_jaipur/status/1280743894481694721?s=20,,,,,,
117714,,08/07/2020,30,M,R/o Majbat,Udalguri,Assam,AS,1,Deceased,,"Jitendra Prasad,admitted on July 7 at Tezpur Medical College, with features of Septicaemia in shock with history of herbal medication,",https://twitter.com/himantabiswa/status/1280752464421982208?s=19,,,,,,
117715,,08/07/2020,,,,Kangra,Himachal Pradesh,HP,1,Hospitalized,,,https://twitter.com/nhm_hp/status/1280760850031144962?s=19,,,,,,
117716,,08/07/2020,,,,Bokaro,Jharkhand,JH,3,Hospitalized,,,https://twitter.com/rnuddkranchi/status/1280759740302102528?s=19,,,,,,
117717,,08/07/2020,,,,Dhanbad,Jharkhand,JH,6,Hospitalized,,,https://twitter.com/rnuddkranchi/status/1280759740302102528?s=19,,,,,,
117718,,08/07/2020,,,,East Singhbhum,Jharkhand,JH,13,Hospitalized,,,https://twitter.com/rnuddkranchi/status/1280759740302102528?s=19,,,,,,
117719,,08/07/2020,,,,Ranchi,Jharkhand,JH,2,Hospitalized,,,https://twitter.com/rnuddkranchi/status/1280759740302102528?s=19,,,,,,
117720,,08/07/2020,,,,Saraikela-Kharsawan,Jharkhand,JH,5,Hospitalized,,,https://twitter.com/rnuddkranchi/status/1280759740302102528?s=19,,,,,,
117721,,08/07/2020,,,,West Singhbhum,Jharkhand,JH,4,Hospitalized,,,https://twitter.com/rnuddkranchi/status/1280759740302102528?s=19,,,,,,
117722,,08/07/2020,,,,Pakur,Jharkhand,JH,5,Hospitalized,,,https://twitter.com/rnuddkranchi/status/1280759740302102528?s=19,,,,,,
117725,,08/07/2020,,,,Anantapur,Andhra Pradesh,AP,87,Hospitalized,,,https://twitter.com/ArogyaAndhra/status/1280773467365732352?s=19,,,,,,
117726,,08/07/2020,,,,Chittoor,Andhra Pradesh,AP,255,Hospitalized,,,https://twitter.com/ArogyaAndhra/status/1280773467365732352?s=19,,,,,,
117727,,08/07/2020,,,,East Godavari,Andhra Pradesh,AP,125,Hospitalized,,,https://twitter.com/ArogyaAndhra/status/1280773467365732352?s=19,,,,,,
117728,,08/07/2020,,,,Guntur,Andhra Pradesh,AP,173,Hospitalized,,,https://twitter.com/ArogyaAndhra/status/1280773467365732352?s=19,,,,,,
117729,,08/07/2020,,,,Y.S.R. Kadapa,Andhra Pradesh,AP,71,Hospitalized,,,https://twitter.com/ArogyaAndhra/status/1280773467365732352?s=19,,,,,,
117730,,08/07/2020,,,,Krishna,Andhra Pradesh,AP,70,Hospitalized,,,https://twitter.com/ArogyaAndhra/status/1280773467365732352?s=19,,,,,,
117731,,08/07/2020,,,,Kurnool,Andhra Pradesh,AP,51,Hospitalized,,,https://twitter.com/ArogyaAndhra/status/1280773467365732352?s=19,,,,,,
117732,,08/07/2020,,,,S.P.S. Nellore,Andhra Pradesh,AP,63,Hospitalized,,,https://twitter.com/ArogyaAndhra/status/1280773467365732352?s=19,,,,,,
117733,,08/07/2020,,,,Prakasam,Andhra Pradesh,AP,2,Hospitalized,,,https://twitter.com/ArogyaAndhra/status/1280773467365732352?s=19,,,,,,
117734,,08/07/2020,,,,Srikakulam,Andhra Pradesh,AP,31,Hospitalized,,,https://twitter.com/ArogyaAndhra/status/1280773467365732352?s=19,,,,,,
117735,,08/07/2020,,,,Visakhapatnam,Andhra Pradesh,AP,38,Hospitalized,,,https://twitter.com/ArogyaAndhra/status/1280773467365732352?s=19,,,,,,
117736,,08/07/2020,,,,Vizianagaram,Andhra Pradesh,AP,38,Hospitalized,,,https://twitter.com/ArogyaAndhra/status/1280773467365732352?s=19,,,,,,
117737,,08/07/2020,,,,West Godavari,Andhra Pradesh,AP,47,Hospitalized,,,https://twitter.com/ArogyaAndhra/status/1280773467365732352?s=19,,,,,,
117738,,08/07/2020,,,,Other State,Andhra Pradesh,AP,2,Hospitalized,,Returned from Tamil Nadu,https://twitter.com/ArogyaAndhra/status/1280773467365732352?s=19,,,,,,
117739,,08/07/2020,,,,Other State,Andhra Pradesh,AP,6,Hospitalized,,Returned from Telangana,https://twitter.com/ArogyaAndhra/status/1280773467365732352?s=19,,,,,,
117740,,08/07/2020,,,,Other State,Andhra Pradesh,AP,1,Hospitalized,,Returned from Kerela,https://twitter.com/ArogyaAndhra/status/1280773467365732352?s=19,,,,,,
117741,,08/07/2020,,,,Foreign Evacuees,Andhra Pradesh,AP,1,Hospitalized,,Returned from Kuwait,https://twitter.com/ArogyaAndhra/status/1280773467365732352?s=19,,,,,,
117742,,08/07/2020,,,,Foreign Evacuees,Andhra Pradesh,AP,1,Hospitalized,,Returned from USA,https://twitter.com/ArogyaAndhra/status/1280773467365732352?s=19,,,,,,
117743,,08/07/2020,,,,Anantapur,Andhra Pradesh,AP,74,Recovered,,,https://twitter.com/ArogyaAndhra/status/1280773467365732352?s=19,,,,,,
117744,,08/07/2020,,,,Chittoor,Andhra Pradesh,AP,171,Recovered,,,https://twitter.com/ArogyaAndhra/status/1280773467365732352?s=19,,,,,,
117745,,08/07/2020,,,,East Godavari,Andhra Pradesh,AP,45,Recovered,,,https://twitter.com/ArogyaAndhra/status/1280773467365732352?s=19,,,,,,
117746,,08/07/2020,,,,Guntur,Andhra Pradesh,AP,341,Recovered,,,https://twitter.com/ArogyaAndhra/status/1280773467365732352?s=19,,,,,,
117747,,08/07/2020,,,,Y.S.R. Kadapa,Andhra Pradesh,AP,21,Recovered,,,https://twitter.com/ArogyaAndhra/status/1280773467365732352?s=19,,,,,,
117748,,08/07/2020,,,,Krishna,Andhra Pradesh,AP,245,Recovered,,,https://twitter.com/ArogyaAndhra/status/1280773467365732352?s=19,,,,,,
117749,,08/07/2020,,,,Kurnool,Andhra Pradesh,AP,255,Recovered,,,https://twitter.com/ArogyaAndhra/status/1280773467365732352?s=19,,,,,,
117750,,08/07/2020,,,,S.P.S. Nellore,Andhra Pradesh,AP,8,Recovered,,,https://twitter.com/ArogyaAndhra/status/1280773467365732352?s=19,,,,,,
117751,,08/07/2020,,,,Prakasam,Andhra Pradesh,AP,82,Recovered,,,https://twitter.com/ArogyaAndhra/status/1280773467365732352?s=19,,,,,,
117752,,08/07/2020,,,,Visakhapatnam,Andhra Pradesh,AP,63,Recovered,,,https://twitter.com/ArogyaAndhra/status/1280773467365732352?s=19,,,,,,
117753,,08/07/2020,,,,Vizianagaram,Andhra Pradesh,AP,6,Recovered,,,https://twitter.com/ArogyaAndhra/status/1280773467365732352?s=19,,,,,,
117754,,08/07/2020,,,,West Godavari,Andhra Pradesh,AP,21,Recovered,,,https://twitter.com/ArogyaAndhra/status/1280773467365732352?s=19,,,,,,
117755,,08/07/2020,,,,Other State,Andhra Pradesh,AP,16,Recovered,,,https://twitter.com/ArogyaAndhra/status/1280773467365732352?s=19,,,,,,
117756,,08/07/2020,,,,Foreign Evacuees,Andhra Pradesh,AP,8,Recovered,,,https://twitter.com/ArogyaAndhra/status/1280773467365732352?s=19,,,,,,
117757,,08/07/2020,,,,Anantapur,Andhra Pradesh,AP,2,Deceased,,,https://twitter.com/ArogyaAndhra/status/1280773467365732352?s=19,,,,,,
117758,,08/07/2020,,,,Chittoor,Andhra Pradesh,AP,1,Deceased,,,https://twitter.com/ArogyaAndhra/status/1280773467365732352?s=19,,,,,,
117759,,08/07/2020,,,,Guntur,Andhra Pradesh,AP,1,Deceased,,,https://twitter.com/ArogyaAndhra/status/1280773467365732352?s=19,,,,,,
117760,,08/07/2020,,,,Krishna,Andhra Pradesh,AP,2,Deceased,,,https://twitter.com/ArogyaAndhra/status/1280773467365732352?s=19,,,,,,
117761,,08/07/2020,,,,Kurnool,Andhra Pradesh,AP,3,Deceased,,,https://twitter.com/ArogyaAndhra/status/1280773467365732352?s=19,,,,,,
117762,,08/07/2020,,,,Visakhapatnam,Andhra Pradesh,AP,1,Deceased,,,https://twitter.com/ArogyaAndhra/status/1280773467365732352?s=19,,,,,,
117763,,08/07/2020,,,,West Godavari,Andhra Pradesh,AP,2,Deceased,,,https://twitter.com/ArogyaAndhra/status/1280773467365732352?s=19,,,,,,
117764,,08/07/2020,,,,Araria,Bihar,BR,8,Hospitalized,,,https://twitter.com/BiharHealthDept/status/1280783302450970624?s=19,,,,,,
117765,,08/07/2020,,,,Arwal,Bihar,BR,12,Hospitalized,,,https://twitter.com/BiharHealthDept/status/1280783302450970624?s=19,,,,,,
117766,,08/07/2020,,,,Aurangabad,Bihar,BR,7,Hospitalized,,,https://twitter.com/BiharHealthDept/status/1280783302450970624?s=19,,,,,,
117767,,08/07/2020,,,,Banka,Bihar,BR,5,Hospitalized,,,https://twitter.com/BiharHealthDept/status/1280783302450970624?s=19,,,,,,
117768,,08/07/2020,,,,Begusarai,Bihar,BR,67,Hospitalized,,,https://twitter.com/BiharHealthDept/status/1280783302450970624?s=19,,,,,,
117769,,08/07/2020,,,,Bhagalpur,Bihar,BR,50,Hospitalized,,,https://twitter.com/BiharHealthDept/status/1280783302450970624?s=19,,,,,,
117770,,08/07/2020,,,,Bhojpur,Bihar,BR,2,Hospitalized,,,https://twitter.com/BiharHealthDept/status/1280783302450970624?s=19,,,,,,
117771,,08/07/2020,,,,Buxar,Bihar,BR,14,Hospitalized,,,https://twitter.com/BiharHealthDept/status/1280783302450970624?s=19,,,,,,
117772,,08/07/2020,,,,Darbhanga,Bihar,BR,8,Hospitalized,,,https://twitter.com/BiharHealthDept/status/1280783302450970624?s=19,,,,,,
117773,,08/07/2020,,,,Patna,Bihar,BR,1,Hospitalized,,Deoria(Sample collected ar Patna),https://twitter.com/BiharHealthDept/status/1280783302450970624?s=19,,,,,,
117774,,08/07/2020,,,,East Champaran,Bihar,BR,8,Hospitalized,,,https://twitter.com/BiharHealthDept/status/1280783302450970624?s=19,,,,,,
117775,,08/07/2020,,,,Gaya,Bihar,BR,15,Hospitalized,,,https://twitter.com/BiharHealthDept/status/1280783302450970624?s=19,,,,,,
117776,,08/07/2020,,,,Patna,Bihar,BR,1,Hospitalized,,Deoria(Sample collected ar Patna),https://twitter.com/BiharHealthDept/status/1280783302450970624?s=19,,,,,,
117777,,08/07/2020,,,,Gopalganj,Bihar,BR,61,Hospitalized,,,https://twitter.com/BiharHealthDept/status/1280783302450970624?s=19,,,,,,
117778,,08/07/2020,,,,Jamui,Bihar,BR,6,Hospitalized,,,https://twitter.com/BiharHealthDept/status/1280783302450970624?s=19,,,,,,
117779,,08/07/2020,,,,Jehanabad,Bihar,BR,18,Hospitalized,,,https://twitter.com/BiharHealthDept/status/1280783302450970624?s=19,,,,,,
117780,,08/07/2020,,,,Kaimur,Bihar,BR,6,Hospitalized,,,https://twitter.com/BiharHealthDept/status/1280783302450970624?s=19,,,,,,
117781,,08/07/2020,,,,Khagaria,Bihar,BR,14,Hospitalized,,,https://twitter.com/BiharHealthDept/status/1280783302450970624?s=19,,,,,,
117782,,08/07/2020,,,,Kishanganj,Bihar,BR,8,Hospitalized,,,https://twitter.com/BiharHealthDept/status/1280783302450970624?s=19,,,,,,
117783,,08/07/2020,,,,Lakhisarai,Bihar,BR,10,Hospitalized,,,https://twitter.com/BiharHealthDept/status/1280783302450970624?s=19,,,,,,
117784,,08/07/2020,,,,Madhepura,Bihar,BR,13,Hospitalized,,,https://twitter.com/BiharHealthDept/status/1280783302450970624?s=19,,,,,,
117785,,08/07/2020,,,,Madhubani,Bihar,BR,17,Hospitalized,,,https://twitter.com/BiharHealthDept/status/1280783302450970624?s=19,,,,,,
117786,,08/07/2020,,,,Munger,Bihar,BR,24,Hospitalized,,,https://twitter.com/BiharHealthDept/status/1280783302450970624?s=19,,,,,,
117787,,08/07/2020,,,,Muzaffarpur,Bihar,BR,17,Hospitalized,,,https://twitter.com/BiharHealthDept/status/1280783302450970624?s=19,,,,,,
117788,,08/07/2020,,,,Nalanda,Bihar,BR,3,Hospitalized,,,https://twitter.com/BiharHealthDept/status/1280783302450970624?s=19,,,,,,
117789,,08/07/2020,,,,Nawada,Bihar,BR,36,Hospitalized,,,https://twitter.com/BiharHealthDept/status/1280783302450970624?s=19,,,,,,
117790,,08/07/2020,,,,Patna,Bihar,BR,235,Hospitalized,,,https://twitter.com/BiharHealthDept/status/1280783302450970624?s=19,,,,,,
117791,,08/07/2020,,,,Purnia,Bihar,BR,22,Hospitalized,,,https://twitter.com/BiharHealthDept/status/1280783302450970624?s=19,,,,,,
117792,,08/07/2020,,,,Rohtas,Bihar,BR,7,Hospitalized,,,https://twitter.com/BiharHealthDept/status/1280783302450970624?s=19,,,,,,
117793,,08/07/2020,,,,Saharsa,Bihar,BR,5,Hospitalized,,,https://twitter.com/BiharHealthDept/status/1280783302450970624?s=19,,,,,,
117794,,08/07/2020,,,,Samastipur,Bihar,BR,2,Hospitalized,,,https://twitter.com/BiharHealthDept/status/1280783302450970624?s=19,,,,,,
117795,,08/07/2020,,,,Sheikhpura,Bihar,BR,8,Hospitalized,,,https://twitter.com/BiharHealthDept/status/1280783302450970624?s=19,,,,,,
117796,,08/07/2020,,,,Sheohar,Bihar,BR,2,Hospitalized,,,https://twitter.com/BiharHealthDept/status/1280783302450970624?s=19,,,,,,
117797,,08/07/2020,,,,Siwan,Bihar,BR,20,Hospitalized,,,https://twitter.com/BiharHealthDept/status/1280783302450970624?s=19,,,,,,
117798,,08/07/2020,,,,Supaul,Bihar,BR,13,Hospitalized,,,https://twitter.com/BiharHealthDept/status/1280783302450970624?s=19,,,,,,
117799,,08/07/2020,,,,Vaishali,Bihar,BR,3,Hospitalized,,,https://twitter.com/BiharHealthDept/status/1280783302450970624?s=19,,,,,,
117800,,08/07/2020,,,,West Champaran,Bihar,BR,1,Hospitalized,,,https://twitter.com/BiharHealthDept/status/1280783302450970624?s=19,,,,,,
117801,,08/07/2020,,,,Daman,Dadra and Nagar Haveli and Daman and Diu,DN,10,Recovered,,,https://twitter.com/CharmieParekh/status/1280793483926597634?s=20,,,,,,
117802,,08/07/2020,,,,Daman,Dadra and Nagar Haveli and Daman and Diu,DN,14,Hospitalized,,"13 are HRCs of previous positives and were already in quarantine;1 was in police custody,tested before sending to sub-jail.",https://twitter.com/CharmieParekh/status/1280793483926597634?s=20,,,,,,
117806,,08/07/2020,,,,Gurugram,Haryana,HR,60,Hospitalized,,,http://nhmharyana.gov.in/WriteReadData/userfiles/file/CoronaVirus/Daily%20Bulletin%20of%20COVID%2019%20as%20on%2008-07-20%20Morning.pdf,,,,,,
117807,,08/07/2020,,,,Sonipat,Haryana,HR,66,Hospitalized,,,http://nhmharyana.gov.in/WriteReadData/userfiles/file/CoronaVirus/Daily%20Bulletin%20of%20COVID%2019%20as%20on%2008-07-20%20Morning.pdf,,,,,,
117808,,08/07/2020,,,,Rohtak,Haryana,HR,34,Hospitalized,,,http://nhmharyana.gov.in/WriteReadData/userfiles/file/CoronaVirus/Daily%20Bulletin%20of%20COVID%2019%20as%20on%2008-07-20%20Morning.pdf,,,,,,
117809,,08/07/2020,,,,Palwal,Haryana,HR,7,Hospitalized,,,http://nhmharyana.gov.in/WriteReadData/userfiles/file/CoronaVirus/Daily%20Bulletin%20of%20COVID%2019%20as%20on%2008-07-20%20Morning.pdf,,,,,,
117810,,08/07/2020,,,,Karnal,Haryana,HR,13,Hospitalized,,,http://nhmharyana.gov.in/WriteReadData/userfiles/file/CoronaVirus/Daily%20Bulletin%20of%20COVID%2019%20as%20on%2008-07-20%20Morning.pdf,,,,,,
117811,,08/07/2020,,,,Hisar,Haryana,HR,28,Hospitalized,,,http://nhmharyana.gov.in/WriteReadData/userfiles/file/CoronaVirus/Daily%20Bulletin%20of%20COVID%2019%20as%20on%2008-07-20%20Morning.pdf,,,,,,
117812,,08/07/2020,,,,Jhajjar,Haryana,HR,22,Hospitalized,,,http://nhmharyana.gov.in/WriteReadData/userfiles/file/CoronaVirus/Daily%20Bulletin%20of%20COVID%2019%20as%20on%2008-07-20%20Morning.pdf,,,,,,
117813,,08/07/2020,,,,Rewari,Haryana,HR,69,Hospitalized,,,http://nhmharyana.gov.in/WriteReadData/userfiles/file/CoronaVirus/Daily%20Bulletin%20of%20COVID%2019%20as%20on%2008-07-20%20Morning.pdf,,,,,,
117814,,08/07/2020,,,,Nuh,Haryana,HR,2,Hospitalized,,,http://nhmharyana.gov.in/WriteReadData/userfiles/file/CoronaVirus/Daily%20Bulletin%20of%20COVID%2019%20as%20on%2008-07-20%20Morning.pdf,,,,,,